RE: 2.6.5-rc2-mm4

From: Sid Boyce
Date: Fri Mar 26 2004 - 18:29:48 EST

I'm getting the same compile failure on -mm4 as I was on -mm3.
HOSTCC usr/gen_init_cpio
CPIO usr/initramfs_data.cpio
GZIP usr/initramfs_data.cpio.gz
AS usr/initramfs_data.o
LD usr/built-in.o
CC arch/x86_64/kernel/process.o
CC arch/x86_64/kernel/semaphore.o
CC arch/x86_64/kernel/signal.o
arch/x86_64/kernel/signal.c: In function `do_signal':
arch/x86_64/kernel/signal.c:426: warning: passing arg 2 of `get_signal_to_deliver' from incompatible poi
nter type
arch/x86_64/kernel/signal.c:426: error: too few arguments to function `get_signal_to_deliver'
make[1]: *** [arch/x86_64/kernel/signal.o] Error 1
make: *** [arch/x86_64/kernel] Error 2

Sid Boyce .... Hamradio G3VBV and keen Flyer
Linux Only Shop.

To unsubscribe from this list: send the line "unsubscribe linux-kernel" in
the body of a message to majordomo@xxxxxxxxxxxxxxx
More majordomo info at
Please read the FAQ at