2.6.10-rc1-mm4: net/tulip/xircom_tulip_cb.c compile error

From: Adrian Bunk
Date: Tue Nov 09 2004 - 15:31:58 EST

On Tue, Nov 09, 2004 at 07:49:09AM -0800, Andrew Morton wrote:
> Changes since 2.6.10-rc1-mm3:
> bk-netdev.patch

<-- snip -->

CC drivers/net/tulip/xircom_tulip_cb.o
drivers/net/tulip/xircom_tulip_cb.c: In function `__check_debug':
drivers/net/tulip/xircom_tulip_cb.c:122: error: `debug' undeclared (first use in this function)
drivers/net/tulip/xircom_tulip_cb.c:122: error: (Each undeclared identifier is reported only once
drivers/net/tulip/xircom_tulip_cb.c:122: error: for each function it appears in.)
make[3]: *** [drivers/net/tulip/xircom_tulip_cb.o] Error 1

<-- snip -->



"Is there not promise of rain?" Ling Tan asked suddenly out
of the darkness. There had been need of rain for many days.
"Only a promise," Lao Er said.
Pearl S. Buck - Dragon Seed

To unsubscribe from this list: send the line "unsubscribe linux-kernel" in
the body of a message to majordomo@xxxxxxxxxxxxxxx
More majordomo info at http://vger.kernel.org/majordomo-info.html
Please read the FAQ at http://www.tux.org/lkml/