2.6.17-rc4-mm3 - Build error in jffs

From: Martin J. Bligh
Date: Mon May 22 2006 - 11:40:11 EST


fs/jffs2/scan.c:530:92: macro "jffs2_sum_scan_sumnode" passed 5 arguments, but takes just 4
fs/jffs2/scan.c: In function `jffs2_scan_eraseblock':
fs/jffs2/scan.c:530: error: `jffs2_sum_scan_sumnode' undeclared (first use in this function)
fs/jffs2/scan.c:530: error: (Each undeclared identifier is reported only once
fs/jffs2/scan.c:530: error: for each function it appears in.)
make[2]: *** [fs/jffs2/scan.o] Error 1
make[1]: *** [fs/jffs2] Error 2
make: *** [fs] Error 2
To unsubscribe from this list: send the line "unsubscribe linux-kernel" in
the body of a message to majordomo@xxxxxxxxxxxxxxx
More majordomo info at http://vger.kernel.org/majordomo-info.html
Please read the FAQ at http://www.tux.org/lkml/