linux-next: build failure after merge of the nfs tree

From: Stephen Rothwell
Date: Tue May 15 2012 - 22:49:51 EST

Hi Trond,

After merging the nfs tree, today's linux-next build (powerpc
ppc64_defconfig) failed like this:

fs/nfs/super.c: In function 'nfs_get_cache_cookie':
fs/nfs/super.c:2361:12: error: 'struct nfs_server' has no member named 'fscache_key'
fs/nfs/super.c:2362:16: error: 'struct nfs_server' has no member named 'fscache_key'
fs/nfs/super.c:2363:16: error: 'struct nfs_server' has no member named 'fscache_key'
fs/nfs/super.c:2367:2: warning: passing argument 3 of 'nfs_fscache_get_super_cookie' makes pointer from integer without a cast [enabled by default]
fs/nfs/fscache.h:173:20: note: expected 'struct nfs_clone_mount *' but argument is of type 'int'

Casued by commit 2311b9439ce8 ("NFS: Don't pass mount data to
nfs_fscache_get_super_cookie()"). This build has CONFIG_NFS_FSCACHE
unset. grep is your friend.

I have used the nfs tree from next-20120514 for today.

Stephen Rothwell sfr@xxxxxxxxxxxxxxxx

Attachment: pgp00000.pgp
Description: PGP signature