3.10.0-RC6 compile failure in lpfc_vport

From: Christopher T Vogan
Date: Tue Jun 18 2013 - 10:06:10 EST

Hit a compile issue when compiling the 3.10.0-RC6 kernel. Did not see
this problem on the RC5 kernel. Used the same .config.

CC [M] drivers/scsi/lpfc/lpfc_attr.o
CC [M] drivers/scsi/lpfc/lpfc_vport.o
{standard input}: Assembler messages:
{standard input}:67920: Error: symbol definition loop encountered at `#\'
gcc: Internal error: Segmentation fault (program as)
Please submit a full bug report.
See <http://bugzilla.redhat.com/bugzilla> for instructions.
make[3]: *** [drivers/scsi/lpfc/lpfc_vport.o] Error 1
make[2]: *** [drivers/scsi/lpfc] Error 2
make[1]: *** [drivers/scsi] Error 2
make: *** [drivers] Error 2

Christopher Vogan
Dept. W98 NFS Development & Test

To unsubscribe from this list: send the line "unsubscribe linux-kernel" in
the body of a message to majordomo@xxxxxxxxxxxxxxx
More majordomo info at http://vger.kernel.org/majordomo-info.html
Please read the FAQ at http://www.tux.org/lkml/