3.17-rc3 fails compile in x86/pci/irq.c

From: Pete Clements
Date: Mon Sep 01 2014 - 07:31:39 EST

Fyi -- i386 UP

CC arch/x86/pci/irq.o
arch/x86/pci/irq.c: In function 'pirq_disable_irq':
arch/x86/pci/irq.c:1259:2: error: implicit declaration of function 'mp_should_keep_irq' [-Werror=implicit-function-declaration]
cc1: some warnings being treated as errors
make[1]: *** [arch/x86/pci/irq.o] Error 1
make: *** [arch/x86/pci] Error 2

Pete Clements
To unsubscribe from this list: send the line "unsubscribe linux-kernel" in
the body of a message to majordomo@xxxxxxxxxxxxxxx
More majordomo info at http://vger.kernel.org/majordomo-info.html
Please read the FAQ at http://www.tux.org/lkml/