Re: [PATCH 5.10 000/130] 5.10.131-rc1 review

From: Florian Fainelli
Date: Tue Jul 12 2022 - 19:16:14 EST

On 7/12/22 11:37, Greg Kroah-Hartman wrote:
This is the start of the stable review cycle for the 5.10.131 release.
There are 130 patches in this series, all will be posted as a response
to this one. If anyone has any issues with these being applied, please
let me know.

Responses should be made by Thu, 14 Jul 2022 18:32:19 +0000.
Anything received after that time might be too late.

The whole patch series can be found in one patch at:
or in the git tree and branch at:
git:// linux-5.10.y
and the diffstat can be found below.


greg k-h

perf fails to build with:

CC /local/users/fainelli/buildroot/output/arm64/build/linux-custom/tools/perf/util/intel-pt-decoder/intel-pt-insn-decoder.o
In file included from util/intel-pt-decoder/intel-pt-insn-decoder.c:15:
util/intel-pt-decoder/../../../arch/x86/lib/insn.c:13:10: fatal error: asm/inat.h: No such file or directory
#include <asm/inat.h> /* __ignore_sync_check__ */
compilation terminated.
make[7]: *** [util/intel-pt-decoder/Build:14: /local/users/fainelli/buildroot/output/arm64/build/linux-custom/tools/perf/util/intel-pt-decoder/intel-pt-insn-decoder.o] Error 1
make[6]: *** [/local/users/fainelli/buildroot/output/arm64/build/linux-custom/tools/build/ intel-pt-decoder] Error 2
make[5]: *** [/local/users/fainelli/buildroot/output/arm64/build/linux-custom/tools/build/ util] Error 2
make[4]: *** [Makefile.perf:643: /local/users/fainelli/buildroot/output/arm64/build/linux-custom/tools/perf/perf-in.o] Error 2
make[3]: *** [Makefile.perf:229: sub-make] Error 2
make[2]: *** [Makefile:70: all] Error 2
make[1]: *** [package/ /local/users/fainelli/buildroot/output/arm64/build/linux-tools/.stamp_built] Error 2
make: *** [Makefile:27: _all] Error 2

you will need to pick this patch as well:

With that one applied:

On ARCH_BRCMSTB using 32-bit and 64-bit ARM kernels:

Tested-by: Florian Fainelli <f.fainelli@xxxxxxxxx>