linux-next: test failure after merge of the landlock tree
From: Mark Brown
Date: Fri Oct 09 2026 - 20:31:15 EST
Hi all,
After merging the landlock tree, today's linux-next arm64 kunit failed
like this:
[00:12:55] ============================================================
[00:12:55] ================ landlock_cap (5 subtests) =================
[00:12:55] # test_cap_to_bit_invalid: EXPECTATION FAILED at security/landlock/cap.c:113
[00:12:55] Expected kunit_suppressed_warning_count(__kunit_suppress) == 1, but
[00:12:55] kunit_suppressed_warning_count(__kunit_suppress) == 2 (0x2)
[00:12:55] [FAILED] test_cap_to_bit_invalid
[00:12:55] # module: landlock
[00:12:55] # landlock_cap: pass:4 fail:1 skip:0 total:5
[00:12:55] # Totals: pass:4 fail:1 skip:0 total:5
[00:12:55] ================== [FAILED] landlock_cap ===================
[00:12:55] ============================================================
Caused by commit
b6a56b30b9d5a (landlock: Enforce capability restrictions)
Due to the prior build failures I have merged the version from
next-20261001 instead.