[linux-next] build failure

From: divya
Date: Thu Aug 05 2010 - 01:32:48 EST

Yestersday's linux-next(2.6.35_next_20100802) build fails with the following error on both system p and x.

drivers/net/ixgbe/ixgbe_main.c: In function 'ixgbe_select_queue':
drivers/net/ixgbe/ixgbe_main.c:6159: error: 'struct ixgbe_fcoe' has no member named 'up'
drivers/net/ixgbe/ixgbe_main.c: In function 'ixgbe_xmit_frame':
drivers/net/ixgbe/ixgbe_main.c:6221: error: 'struct ixgbe_fcoe' has no member named 'up'
make[3]: *** [drivers/net/ixgbe/ixgbe_main.o] Error 1
make[2]: *** [drivers/net/ixgbe] Error 2
make[2]: *** Waiting for unfinished jobs....
make[1]: *** [drivers/net] Error 2
make: *** [drivers] Error 2


To unsubscribe from this list: send the line "unsubscribe linux-kernel" in
the body of a message to majordomo@xxxxxxxxxxxxxxx
More majordomo info at http://vger.kernel.org/majordomo-info.html
Please read the FAQ at http://www.tux.org/lkml/