2.6.15-rc1-git4 build failure on ppc64

From: Badari Pulavarty
Date: Wed Nov 16 2005 - 19:41:14 EST

Hi Andy,

I get following compile error on PPC64 - while trying to compile

arch/powerpc/mm/numa.c: In function `dump_numa_topology':
arch/powerpc/mm/numa.c:516: error: `SECTION_SIZE_BITS' undeclared (first
use in this function)
arch/powerpc/mm/numa.c:516: error: (Each undeclared identifier is
reported only once
arch/powerpc/mm/numa.c:516: error: for each function it appears in.)
make[1]: *** [arch/powerpc/mm/numa.o] Error 1
make[1]: *** Waiting for unfinished jobs....
make: *** [arch/powerpc/mm] Error 2


To unsubscribe from this list: send the line "unsubscribe linux-kernel" in
the body of a message to majordomo@xxxxxxxxxxxxxxx
More majordomo info at http://vger.kernel.org/majordomo-info.html
Please read the FAQ at http://www.tux.org/lkml/