Re: 2.6.15-rc1-git4 build failure on ppc64

From: Andy Whitcroft
Date: Wed Nov 16 2005 - 19:51:01 EST

Badari Pulavarty wrote:

> I get following compile error on PPC64 - while trying to compile
> arch/powerpc/mm/numa.c: In function `dump_numa_topology':
> arch/powerpc/mm/numa.c:516: error: `SECTION_SIZE_BITS' undeclared (first
> use in this function)
> arch/powerpc/mm/numa.c:516: error: (Each undeclared identifier is
> reported only once
> arch/powerpc/mm/numa.c:516: error: for each function it appears in.)
> make[1]: *** [arch/powerpc/mm/numa.o] Error 1
> make[1]: *** Waiting for unfinished jobs....
> make: *** [arch/powerpc/mm] Error 2

Can you drop me a copy of your .config please. I'll have a poke at it
in the morning.

To unsubscribe from this list: send the line "unsubscribe linux-kernel" in
the body of a message to majordomo@xxxxxxxxxxxxxxx
More majordomo info at
Please read the FAQ at